BDBM50023270 CHEMBL3329766
SMILES FC(F)(F)c1ccccc1CN(CC1CCC1)C(=O)C1CCN(CC1)S(=O)(=O)c1ccc2[nH]ncc2c1
InChI Key InChIKey=LOICOJNJRUFFNB-UHFFFAOYSA-N
Data  2 EC50
  Tab Delimited (TSV)   2D SDfile   Computed 3D by Vconf -m prep SDfile
Find this compound or compounds like it in BindingDB:
Activity Spreadsheet -- Enzyme Inhibition Constant Data from BindingDB
Found 2 hits for monomerid = 50023270
TargetMuscarinic acetylcholine receptor M5(Homo sapiens (Human))
Vanderbilt University Medical Center
Curated by ChEMBL
LigandPNGBDBM50023270(CHEMBL3329766)
Affinity DataEC50:  130nM. Assay description: Positive allosteric modulator activity at human muscarinic acetylcholine receptor subtype 5 expressed in CHO cells by calcium mobilization assay
In DepthDetails ArticlePubMed
TargetMuscarinic acetylcholine receptor M5(Homo sapiens (Human))
Vanderbilt University Medical Center
Curated by ChEMBL
LigandPNGBDBM50023270(CHEMBL3329766)
Affinity DataEC50:  129nM. Assay description: Positive allosteric modulator activity at human muscarinic acetylcholine receptor subtype 5 expressed in CHO cells by calcium mobilization assay
In DepthDetails ArticlePubMed