BDBM50023502 (9-Chloro-2-furan-2-yl-[1,2,4]triazolo[1,5-c]quinazolin-5-yl)-dimethyl-amine::CHEMBL7759
SMILES CN(C)c1nc2ccc(Cl)cc2c2nc(nn12)-c1ccco1
InChI Key InChIKey=FQCINMURYBKZPG-UHFFFAOYSA-N
Data  2 IC50
  Tab Delimited (TSV)   2D SDfile   Computed 3D by Vconf -m prep SDfile
Find this compound or compounds like it in BindingDB:
Activity Spreadsheet -- Enzyme Inhibition Constant Data from BindingDB
Found 2 hits for monomerid = 50023502
TargetAdenosine receptor A2a/A2b(Rattus norvegicus)
Ciba-Geigy
Curated by ChEMBL
LigandPNGBDBM50023502((9-Chloro-2-furan-2-yl-[1,2,4]triazolo[1,5-c]quina...)
Affinity DataIC50: >1.00E+4nM. Assay description: Inhibition of binding to Adenosine-2 receptor using [3H]NECA in rat striatum
In DepthDetails ArticlePubMed
TargetAdenosine receptor A1(Rattus norvegicus (rat))
Ciba-Geigy
Curated by ChEMBL
LigandPNGBDBM50023502((9-Chloro-2-furan-2-yl-[1,2,4]triazolo[1,5-c]quina...)
Affinity DataIC50: >1.00E+4nM. Assay description: Inhibition of binding towards adenosine A1 receptor using [3H]-N-cyclohexyladenosine ([3H]-CHA) in rat whole brain membranes.
In DepthDetails ArticlePubMed