BDBM50023505 2-Furan-2-yl-9-methoxy-[1,2,4]triazolo[1,5-c]quinazolin-5-ylamine::CHEMBL267015
SMILES COc1ccc2nc(N)n3nc(nc3c2c1)-c1ccco1
InChI Key InChIKey=LFLJKBYCYRZHHS-UHFFFAOYSA-N
Data  2 IC50
  Tab Delimited (TSV)   2D SDfile   Computed 3D by Vconf -m prep SDfile
Find this compound or compounds like it in BindingDB:
Activity Spreadsheet -- Enzyme Inhibition Constant Data from BindingDB
Found 2 hits for monomerid = 50023505
TargetAdenosine receptor A2a/A2b(Rattus norvegicus)
Ciba-Geigy
Curated by ChEMBL
LigandPNGBDBM50023505(2-Furan-2-yl-9-methoxy-[1,2,4]triazolo[1,5-c]quina...)
Affinity DataIC50:  19nM. Assay description: Inhibition of binding to Adenosine-2 receptor using [3H]NECA in rat striatum
In DepthDetails ArticlePubMed
TargetAdenosine receptor A1(Rattus norvegicus (rat))
Ciba-Geigy
Curated by ChEMBL
LigandPNGBDBM50023505(2-Furan-2-yl-9-methoxy-[1,2,4]triazolo[1,5-c]quina...)
Affinity DataIC50:  31nM. Assay description: Inhibition of binding towards adenosine A1 receptor using [3H]-N-cyclohexyladenosine ([3H]-CHA) in rat whole brain membranes.
In DepthDetails ArticlePubMed