BDBM50023523 2,2-Dimethyl-propionic acid 2-[2,4-bis-(2,2-dimethyl-propionyloxy)-benzoyl]-5-(2,2-dimethyl-propionyloxy)-phenyl ester::CHEMBL267081
SMILES CC(C)(C)C(=O)Oc1ccc(C(=O)c2ccc(OC(=O)C(C)(C)C)cc2OC(=O)C(C)(C)C)c(OC(=O)C(C)(C)C)c1
InChI Key InChIKey=DETJDJKUOCMVDN-UHFFFAOYSA-N
Data  1 KI  1 IC50
  Tab Delimited (TSV)   2D SDfile   Computed 3D by Vconf -m prep SDfile
Find this compound or compounds like it in BindingDB:
Activity Spreadsheet -- Enzyme Inhibition Constant Data from BindingDB
Found 2 hits for monomerid = 50023523
TargetNeutrophil elastase(Homo sapiens (Human))
Searle Research And Development
Curated by ChEMBL
LigandPNGBDBM50023523(2,2-Dimethyl-propionic acid 2-[2,4-bis-(2,2-dimeth...)
Affinity DataKi:  68nM. Assay description: Binding affinity towards human leukocyte elastase at 10e-8 M
In DepthDetails ArticlePubMed
TargetNeutrophil elastase(Homo sapiens (Human))
Searle Research And Development
Curated by ChEMBL
LigandPNGBDBM50023523(2,2-Dimethyl-propionic acid 2-[2,4-bis-(2,2-dimeth...)
Affinity DataIC50:  27nM. Assay description: Binding affinity towards human leukocyte elastase at 10e-7 M
In DepthDetails ArticlePubMed