BDBM50023824 CHEMBL3325510
SMILES OCCCN1CCC(CC1)NC(=O)c1ccc(COc2ccc(cc2)C(F)(F)F)cc1
InChI Key InChIKey=DPHUOMOEIRXIQO-UHFFFAOYSA-N
Data  1 IC50
  Tab Delimited (TSV)   2D SDfile   Computed 3D by Vconf -m prep SDfile
Find this compound or compounds like it in BindingDB:
Activity Spreadsheet -- Enzyme Inhibition Constant Data from BindingDB
Found 1 hit for monomerid = 50023824
TargetSodium- and chloride-dependent glycine transporter 2(Homo sapiens (Human))
Toray Industries
Curated by ChEMBL
LigandPNGBDBM50023824(CHEMBL3325510)
Affinity DataIC50:  181nM. Assay description: Inhibition of human GlyT2 transfected in HEK293 cells assessed as [3H]glycine uptake after 2 hrs
In DepthDetails ArticlePubMed