BDBM50023905 2-{4-[(2-Amino-4-oxo-1,4-dihydro-pteridin-6-ylmethyl)-methyl-amino]-benzoylamino}-pentanedioic acid(10-methylfolate)::CHEMBL158990::METHOPTERINE
SMILES CN(Cc1cnc2nc(N)[nH]c(=O)c2n1)c1ccc(cc1)C(=O)N[C@@H](CCC(O)=O)C(O)=O
InChI Key InChIKey=HLIXOCXUWGDBNP-ZDUSSCGKSA-N
Data  1 KI
PDB links: 1 PDB ID matches this monomer.
  Tab Delimited (TSV)   2D SDfile   Computed 3D by Vconf -m prep SDfile
Find this compound or compounds like it in BindingDB:
Activity Spreadsheet -- Enzyme Inhibition Constant Data from BindingDB
Found 1 hit for monomerid = 50023905
TargetThymidylate synthase(Homo sapiens (Human))
TBA
Curated by ChEMBL
LigandPNGBDBM50023905(2-{4-[(2-Amino-4-oxo-1,4-dihydro-pteridin-6-ylmeth...)
Affinity DataKi:  1.00E+3nM. Assay description: Inhibitory constant of thymidylate synthase was determined in human AML cells
In DepthDetails ArticlePubMed