BDBM50023924 CHEMBL3325507
SMILES CN1CCC(CC1)NC(=O)c1ccc(COc2ccc(cc2)C(F)(F)F)cc1
InChI Key InChIKey=IVOIYPHGIHJNMU-UHFFFAOYSA-N
Data  3 IC50
  Tab Delimited (TSV)   2D SDfile   Computed 3D by Vconf -m prep SDfile
Find this compound or compounds like it in BindingDB:
Activity Spreadsheet -- Enzyme Inhibition Constant Data from BindingDB
Found 3 hits for monomerid = 50023924
TargetSodium- and chloride-dependent glycine transporter 2(Homo sapiens (Human))
Toray Industries
Curated by ChEMBL
LigandPNGBDBM50023924(CHEMBL3325507)
Affinity DataIC50:  105nM. Assay description: Inhibition of human GlyT2 transfected in HEK293 cells assessed as [3H]glycine uptake after 2 hrs
In DepthDetails ArticlePubMed
TargetSodium- and chloride-dependent glycine transporter 2(Homo sapiens (Human))
Toray Industries
Curated by ChEMBL
LigandPNGBDBM50023924(CHEMBL3325507)
Affinity DataIC50:  105nM. Assay description: Reversible inhibition of recombinant human GlyT2 expressed in HEK293 cells assessed as reduction in [3H]-glycine uptake after 2 hrs by top count assa...
In DepthDetails ArticlePubMed
TargetSodium- and chloride-dependent glycine transporter 2(Homo sapiens (Human))
Toray Industries
Curated by ChEMBL
LigandPNGBDBM50023924(CHEMBL3325507)
Affinity DataIC50:  105nM. Assay description: Inhibition of human GlyT-2 expressed in HEK293 cells assessed as reduction in [3H]-glycine uptake
In DepthDetails ArticlePubMed