BDBM50024115 CHEMBL3325491
SMILES CC(C)(C)c1ccc(OCc2ccc(cc2)C(=O)NC2CCN(C2)C2CCCCC2)cc1
InChI Key InChIKey=VNUFIDKUMNRAMN-UHFFFAOYSA-N
Data  1 IC50
  Tab Delimited (TSV)   2D SDfile   Computed 3D by Vconf -m prep SDfile
Find this compound or compounds like it in BindingDB:
Activity Spreadsheet -- Enzyme Inhibition Constant Data from BindingDB
Found 1 hit for monomerid = 50024115
TargetSodium- and chloride-dependent glycine transporter 2(Homo sapiens (Human))
Toray Industries
Curated by ChEMBL
LigandPNGBDBM50024115(CHEMBL3325491)
Affinity DataIC50:  2.20E+3nM. Assay description: Inhibition of human GlyT2 transfected in HEK293 cells assessed as [3H]glycine uptake after 2 hrs
In DepthDetails ArticlePubMed