BDBM50024152 CHEMBL3142182::{1-[1-[1-(1-Hydroxy-2-{2-methyl-1-[(pyridin-2-ylmethyl)-carbamoyl]-butylcarbamoyl}-ethyl)-3-methyl-butylcarbamoyl]-2-(1H-imidazol-4-yl)-ethylcarbamoyl]-2-phenyl-ethyl}-methyl-carbamic acid tert-butyl ester
SMILES CC[C@H](C)[C@H](NC(=O)C[C@H](O)[C@H](CC(C)C)NC(=O)[C@H](Cc1c[nH]cn1)NC(=O)[C@H](Cc1ccccc1)N(C)C(=O)OC(C)(C)C)C(=O)NCc1ccccn1
InChI Key InChIKey=YCORHQFIUPALIG-UHFFFAOYSA-N
Data  1 IC50
  Tab Delimited (TSV)   2D SDfile   Computed 3D by Vconf -m prep SDfile
Find this compound or compounds like it in BindingDB:
Activity Spreadsheet -- Enzyme Inhibition Constant Data from BindingDB
Found 1 hit for monomerid = 50024152
TargetRenin(Homo sapiens (Human))
TBA
Curated by ChEMBL
LigandPNGBDBM50024152(CHEMBL3142182 | {1-[1-[1-(1-Hydroxy-2-{2-methyl-1-...)
Affinity DataIC50:  720nM. Assay description: Inhibition of human plasma renin
In DepthDetails ArticlePubMed