BDBM50024329 3-(3-Benzyl-ureido)-N-{1-[1-(2-butoxycarbonyl-ethylcarbamoyl)-2-(1H-indol-3-yl)-ethylcarbamoyl]-pentyl}-succinamic acid::CHEMBL423260
SMILES CCCCOC(=O)CCNC(=O)[C@H](Cc1c[nH]c2ccccc12)NC(=O)[C@@H](CCCC)NC(=O)[C@H](CC(O)=O)NC(=O)NCc1ccccc1
InChI Key InChIKey=MXWOGCNBRODQON-NGDRWEMDSA-N
Data  1 IC50
  Tab Delimited (TSV)   2D SDfile   Computed 3D by Vconf -m prep SDfile
Find this compound or compounds like it in BindingDB:
Activity Spreadsheet -- Enzyme Inhibition Constant Data from BindingDB
Found 1 hit for monomerid = 50024329
TargetGastrin/cholecystokinin type B receptor(Homo sapiens (Human))
TBA
Curated by ChEMBL
LigandPNGBDBM50024329(3-(3-Benzyl-ureido)-N-{1-[1-(2-butoxycarbonyl-ethy...)
Affinity DataIC50:  7.80E+4nM. Assay description: In vitro inhibitory activity for binding of [125I]-(Nle11)-HG-13 to gastrin receptor on isolated rabbit gastric mucosal cells.
In DepthDetails ArticlePubMed