BDBM50024330 3-(3-Benzyl-ureido)-3-{2-[2-tert-butoxycarbonylamino-3-(1H-indol-3-yl)-propionylamino]-4-methyl-pentanoylamino}-propionic acid::CHEMBL431116
SMILES CC(C)C[C@H](NC(=O)[C@H](Cc1c[nH]c2ccccc12)NC(=O)OC(C)(C)C)C(=O)N[C@@H](CC(O)=O)C(=O)N[C@@H](Cc1ccccc1)C(N)=O
InChI Key InChIKey=RPLROAMNQORAHK-LJWNLINESA-N
Data  2 IC50
  Tab Delimited (TSV)   2D SDfile   Computed 3D by Vconf -m prep SDfile
Find this compound or compounds like it in BindingDB:
Activity Spreadsheet -- Enzyme Inhibition Constant Data from BindingDB
Found 2 hits for monomerid = 50024330
TargetGastrin/cholecystokinin type B receptor(Homo sapiens (Human))
TBA
Curated by ChEMBL
LigandPNGBDBM50024330(3-(3-Benzyl-ureido)-3-{2-[2-tert-butoxycarbonylami...)
Affinity DataIC50:  300nM. Assay description: In vitro inhibitory activity for binding of [125I]-(Nle11)-HG-13 to gastrin receptor on isolated rabbit gastric mucosal cells.
In DepthDetails ArticlePubMed
TargetGastrin/cholecystokinin type B receptor(Homo sapiens (Human))
TBA
Curated by ChEMBL
LigandPNGBDBM50024330(3-(3-Benzyl-ureido)-3-{2-[2-tert-butoxycarbonylami...)
Affinity DataIC50:  500nM. Assay description: Invitro inhibition of binding of [125I]-(Nle)-HG-13 labeled Cholecystokinin type B receptor on isolated gastric mucosal cells of rabbit
In DepthDetails ArticlePubMed