BDBM50024334 CHEMBL163253::N-{1-[2-tert-Butoxycarbonylamino-3-(1H-indol-3-yl)-propionylamino]-pentyl}-3-(3-phenyl-propionylamino)-succinamic acid
SMILES CCCC[C@@H](NC(=O)[C@H](CC(O)=O)NC(=O)CCc1ccccc1)NC(=O)[C@@H](Cc1c[nH]c2ccccc12)NC(=O)OC(C)(C)C
InChI Key InChIKey=OIZNVJYVTRGWJM-OZNIXHKMSA-N
Data  1 IC50
  Tab Delimited (TSV)   2D SDfile   Computed 3D by Vconf -m prep SDfile
Find this compound or compounds like it in BindingDB:
Activity Spreadsheet -- Enzyme Inhibition Constant Data from BindingDB
Found 1 hit for monomerid = 50024334
TargetGastrin/cholecystokinin type B receptor(Homo sapiens (Human))
TBA
Curated by ChEMBL
LigandPNGBDBM50024334(CHEMBL163253 | N-{1-[2-tert-Butoxycarbonylamino-3-...)
Affinity DataIC50:  1.10E+5nM. Assay description: In vitro inhibitory activity for binding of [125I]-(Nle11)-HG-13 to gastrin receptor on isolated rabbit gastric mucosal cells.
In DepthDetails ArticlePubMed