BDBM50024479 (4-Chloro-phenyl)-cyclopropyl-pyrimidin-5-yl-methanol::CHEMBL282525
SMILES OC(C1CC1)(c1ccc(Cl)cc1)c1cncnc1
InChI Key InChIKey=GHALJIWVFQMGND-UHFFFAOYSA-N
Data  1 EC50
  Tab Delimited (TSV)   2D SDfile   Computed 3D by Vconf -m prep SDfile
Find this compound or compounds like it in BindingDB:
Activity Spreadsheet -- Enzyme Inhibition Constant Data from BindingDB
Found 1 hit for monomerid = 50024479
TargetAromatase(Rattus norvegicus)
TBA
Curated by ChEMBL
LigandPNGBDBM50024479((4-Chloro-phenyl)-cyclopropyl-pyrimidin-5-yl-metha...)
Affinity DataEC50:  5.70E+3nM. Assay description: In vitro inhibition of cytochrome P450 19A1 by rat ovarian microsomes incubated with [3H]androstenedione and NADPH-generating system.
In DepthDetails ArticlePubMed