BDBM50024566 CHEMBL3330624
SMILES CCOc1ccc2cccc(N3CCN(CCCCn4ncc(=O)n(C)c4=O)CC3)c2c1
InChI Key InChIKey=FGJBRAWTNDYRGZ-UHFFFAOYSA-N
Data  1 KI
  Tab Delimited (TSV)   2D SDfile   Computed 3D by Vconf -m prep SDfile
Find this compound or compounds like it in BindingDB:
Activity Spreadsheet -- Enzyme Inhibition Constant Data from BindingDB
Found 1 hit for monomerid = 50024566
Target5-hydroxytryptamine receptor 1A(Homo sapiens (Human))
Stony Brook University
Curated by ChEMBL
LigandPNGBDBM50024566(CHEMBL3330624)
Affinity DataKi:  2.10nM. Assay description: Displacement of [3H]8-OH-DPAT from 5HT1AR (unknown origin) by competition binding assay
In DepthDetails ArticlePubMed