BDBM50024616 CHEMBL415171::[Ala63] Hirudin55-65
SMILES CC[C@H](C)[C@H](NC(=O)[C@H](CCC(O)=O)NC(=O)[C@H](CCC(O)=O)NC(=O)[C@H](Cc1ccccc1)NC(=O)[C@@H](N)CC(O)=O)C(=O)N1CCC[C@H]1C(=O)N[C@@H](CCC(O)=O)C(=O)N[C@@H](CCC(O)=O)C(=O)N[C@@H](C)C(=O)N[C@@H](CC(C)C)C(=O)N[C@@H](CCC(N)=O)C(O)=O
InChI Key InChIKey=RALCJFCSXLZMAF-BJVWNITCSA-N
Data  1 IC50
  Tab Delimited (TSV)   2D SDfile   Computed 3D by Vconf -m prep SDfile
Find this compound or compounds like it in BindingDB:
Activity Spreadsheet -- Enzyme Inhibition Constant Data from BindingDB
Found 1 hit for monomerid = 50024616
TargetProthrombin(Bos taurus (Bovine))
TBA
Curated by ChEMBL
LigandPNGBDBM50024616(CHEMBL415171 | [Ala63] Hirudin55-65)
Affinity DataIC50:  1.36E+4nM. Assay description: Inhibition of plasma fibrin clot formation by thrombin in vitro.
In DepthDetails ArticlePubMed