BDBM50024810 5-Trifluoromethyl-1,2,3,4-tetrahydro-1,4-methano-naphthalen-9-ylamine::CHEMBL70357
SMILES N[C@H]1C2CCC1c1c2cccc1C(F)(F)F
InChI Key InChIKey=HHIJEPNAHYLKPE-AYVLWNQUSA-N
Data  1 KI
  Tab Delimited (TSV)   2D SDfile   Computed 3D by Vconf -m prep SDfile
Find this compound or compounds like it in BindingDB:
Activity Spreadsheet -- Enzyme Inhibition Constant Data from BindingDB
Found 1 hit for monomerid = 50024810
TargetPhenylethanolamine N-methyltransferase(Bos taurus (bovine))
University Of Kansas
Curated by ChEMBL
LigandPNGBDBM50024810(5-Trifluoromethyl-1,2,3,4-tetrahydro-1,4-methano-n...)
Affinity DataKi:  1.21E+4nM. Assay description: Inhibition of Phenylethylamine N-Methyltransferase (PNMT) using radiochemical assay
In DepthDetails ArticlePubMed