BDBM50024972 (+) 6-[2-(3,5-Dichloro-4''-fluoro-biphenyl-2-yl)-vinyl]-4-hydroxy-tetrahydro-pyran-2-one::(-) 6-[2-(3,5-Dichloro-4''-fluoro-biphenyl-2-yl)-vinyl]-4-hydroxy-tetrahydro-pyran-2-one::6-[2-(3,5-Dichloro-4''-fluoro-biphenyl-2-yl)-vinyl]-4-hydroxy-tetrahydro-pyran-2-one::CHEMBL2368970
SMILES O[C@@H]1C[C@H](OC(=O)C1)\C=C\c1c(Cl)cc(Cl)cc1-c1ccc(F)cc1
InChI Key InChIKey=VMMVXGKAALDTIC-XEVLESSRSA-N
Data  4 IC50
  Tab Delimited (TSV)   2D SDfile   Computed 3D by Vconf -m prep SDfile
Find this compound or compounds like it in BindingDB:
Activity Spreadsheet -- Enzyme Inhibition Constant Data from BindingDB
Found 4 hits for monomerid = 50024972
Target3-hydroxy-3-methylglutaryl-coenzyme A reductase(Rattus norvegicus (rat))
TBA
Curated by ChEMBL
LigandPNGBDBM50024972((+) 6-[2-(3,5-Dichloro-4''-fluoro-biphenyl-2-yl)-v...)
Affinity DataIC50:  260nM. Assay description: Inhibition of solubilized partially purified rat liver HMG-CoA reductase
In DepthDetails ArticlePubMed
Target3-hydroxy-3-methylglutaryl-coenzyme A reductase(Rattus norvegicus (rat))
TBA
Curated by ChEMBL
LigandPNGBDBM50024972((+) 6-[2-(3,5-Dichloro-4''-fluoro-biphenyl-2-yl)-v...)
Affinity DataIC50:  5nM. Assay description: Inhibition of solubilized partially purified rat liver HMG-CoA reductase
In DepthDetails ArticlePubMed
Target3-hydroxy-3-methylglutaryl-coenzyme A reductase(Rattus norvegicus (rat))
TBA
Curated by ChEMBL
LigandPNGBDBM50024972((+) 6-[2-(3,5-Dichloro-4''-fluoro-biphenyl-2-yl)-v...)
Affinity DataIC50:  5nM. Assay description: Inhibition of solubilized partially purified rat liver HMG-CoA reductase
In DepthDetails ArticlePubMed
Target3-hydroxy-3-methylglutaryl-coenzyme A reductase(Rattus norvegicus (rat))
TBA
Curated by ChEMBL
LigandPNGBDBM50024972((+) 6-[2-(3,5-Dichloro-4''-fluoro-biphenyl-2-yl)-v...)
Affinity DataIC50:  24nM. Assay description: Compound was tested in vitro for its ability to inhibit rat liver HMG-CoA reductase
In DepthDetails ArticlePubMed