BDBM50025425 17-Hydroxy-10,13-dimethyl-4,5,6,7,8,9,10,11,12,13,14,15,16,17-tetradecahydro-cyclopenta[a]phenanthren-3-one::CHEMBL3349077
SMILES [H][C@@]12CC[C@H](O)[C@@]1(C)CC[C@@]1([H])[C@@]2([H])CCC2CC(=O)C=C[C@]12C
InChI Key InChIKey=OKJCFMUGMSVJBG-UHFFFAOYSA-N
Data  1 IC50
  Tab Delimited (TSV)   2D SDfile   Computed 3D by Vconf -m prep SDfile
Find this compound or compounds like it in BindingDB:
Activity Spreadsheet -- Enzyme Inhibition Constant Data from BindingDB
Found 1 hit for monomerid = 50025425
TargetAndrogen receptor(Rattus norvegicus (Rat))
TBA
Curated by ChEMBL
LigandPNGBDBM50025425(17-Hydroxy-10,13-dimethyl-4,5,6,7,8,9,10,11,12,13,...)
Affinity DataIC50:  1.5nM. Assay description: In vitro antagonist activity against rat prostatic androgen receptor (AR)
In DepthDetails ArticlePubMed