BDBM50025516 BDBM50028395::CHEMBL167093::[1-(1-{1-Hydroxy-2-[1-(3-methyl-butylcarbamoyl)-ethylcarbamoyl]-ethyl}-3-methyl-butylcarbamoyl)-2-methyl-propyl]-carbamic acid tert-butyl ester
SMILES CC(C)CCNC(=O)[C@H](C)NC(=O)C[C@H](O)[C@H](CC(C)C)NC(=O)[C@@H](NC(=O)OC(C)(C)C)C(C)C
InChI Key InChIKey=UDRRUYFFMTVMGM-FLQRSKGTSA-N
Data  2 KI
  Tab Delimited (TSV)   2D SDfile   Computed 3D by Vconf -m prep SDfile
Find this compound or compounds like it in BindingDB:
Activity Spreadsheet -- Enzyme Inhibition Constant Data from BindingDB
Found 2 hits for monomerid = 50025516
TargetPepsin A(Porcine)
TBA
Curated by ChEMBL
LigandPNGBDBM50025516(BDBM50028395 | CHEMBL167093 | [1-(1-{1-Hydroxy-2-[...)
Affinity DataKi:  170nM. Assay description: The compound was tested for inhibition of carboxyl protease (pepsin) inhibition
In DepthDetails ArticlePubMed
TargetCathepsin D(Bos taurus)
TBA
Curated by ChEMBL
LigandPNGBDBM50025516(BDBM50028395 | CHEMBL167093 | [1-(1-{1-Hydroxy-2-[...)
Affinity DataKi:  2.70E+3nM. Assay description: Inhibition of cathepsin D.
In DepthDetails ArticlePubMed