BDBM50025881 4-(3,4-Dihydroxy-phenyl)-1-methyl-pyridinium; bromide::CHEMBL109090
SMILES C[n+]1ccc(cc1)-c1ccc(O)c(O)c1
InChI Key InChIKey=AOYWNCQZPODKJM-UHFFFAOYSA-O
Data  1 KI
  Tab Delimited (TSV)   2D SDfile   Computed 3D by Vconf -m prep SDfile
Find this compound or compounds like it in BindingDB:
Activity Spreadsheet -- Enzyme Inhibition Constant Data from BindingDB
Found 1 hit for monomerid = 50025881
TargetDihydropteridine reductase(Rattus norvegicus)
TBA
Curated by ChEMBL
LigandPNGBDBM50025881(4-(3,4-Dihydroxy-phenyl)-1-methyl-pyridinium; brom...)
Affinity DataKi:  1.90E+3nM. Assay description: Noncompetitive Inhibitory activity against rat striatal synaptosomal DHPR enzyme
In DepthDetails ArticlePubMed