BDBM50025973 7-Hydroxy-4-oxo-4H-chromene-2-carboxylic acid ethyl ester::CHEMBL82749
SMILES CCOC(=O)c1cc(=O)c2ccc(O)cc2o1
InChI Key InChIKey=RKIMFICEWCXBCE-UHFFFAOYSA-N
Data  2 IC50
  Tab Delimited (TSV)   2D SDfile   Computed 3D by Vconf -m prep SDfile
Find this compound or compounds like it in BindingDB:
Activity Spreadsheet -- Enzyme Inhibition Constant Data from BindingDB
Found 2 hits for monomerid = 50025973
TargetAldo-keto reductase family 1 member B1(Rattus norvegicus)
TBA
Curated by ChEMBL
LigandPNGBDBM50025973(7-Hydroxy-4-oxo-4H-chromene-2-carboxylic acid ethy...)
Affinity DataIC50:  2.30E+3nM. Assay description: Inhibitory activity of the compound against rat lens aldose reductase (RLAR).
In DepthDetails ArticlePubMed
TargetAldo-keto reductase family 1 member B1(Homo sapiens (Human))
TBA
Curated by ChEMBL
LigandPNGBDBM50025973(7-Hydroxy-4-oxo-4H-chromene-2-carboxylic acid ethy...)
Affinity DataIC50:  5.00E+3nM. Assay description: Inhibitory activity of the compound against human placental aldose reductase (HPAR)
In DepthDetails ArticlePubMed