BDBM50026064 CHEMBL3335258
SMILES COc1cc(OC)c(C(=O)\C=C\c2ccccc2)c(O)c1CN1CCCC1
InChI Key InChIKey=NTDDWLRUVQHHNR-ZHACJKMWSA-N
Data  1 IC50
  Tab Delimited (TSV)   2D SDfile   Computed 3D by Vconf -m prep SDfile
Find this compound or compounds like it in BindingDB:
Activity Spreadsheet -- Enzyme Inhibition Constant Data from BindingDB
Found 1 hit for monomerid = 50026064
TargetAcetylcholinesterase(Rattus norvegicus (rat))
Hunan University
Curated by ChEMBL
LigandPNGBDBM50026064(CHEMBL3335258)
Affinity DataIC50:  1.61E+4nM. Assay description: Inhibition of Sprague-Dawley rat brain AChE using acetylthiocholin iodide as substrate preincubated for 25 mins by Ellman's/UV-vis spectroscopy analy...
In DepthDetails ArticlePubMed