BDBM50026568 CHEMBL23464::N-(1-Ethyl-pyrrolidin-2-ylmethyl)-3-iodo-2,6-dimethoxy-benzamide
SMILES CCN1CCC[C@H]1CNC(=O)c1c(OC)ccc(I)c1OC
InChI Key InChIKey=JJYGMNQCYKVCSO-NSHDSACASA-N
Data  2 IC50
  Tab Delimited (TSV)   2D SDfile   Computed 3D by Vconf -m prep SDfile
Find this compound or compounds like it in BindingDB:
Activity Spreadsheet -- Enzyme Inhibition Constant Data from BindingDB
Found 2 hits for monomerid = 50026568
TargetD(2) dopamine receptor(Homo sapiens (Human))
University Of Mazandaran
Curated by ChEMBL
LigandPNGBDBM50026568(CHEMBL23464 | N-(1-Ethyl-pyrrolidin-2-ylmethyl)-3-...)
Affinity DataIC50:  0.676nM. Assay description: Antagonist activity at dopamine D2 receptor
In DepthDetails ArticlePubMed
TargetD(2) dopamine receptor(Rattus norvegicus (rat))
TBA
Curated by ChEMBL
LigandPNGBDBM50026568(CHEMBL23464 | N-(1-Ethyl-pyrrolidin-2-ylmethyl)-3-...)
Affinity DataIC50:  2.79E+3nM. Assay description: In vitro binding affinity at Dopamine receptor D2 in rat by displacing [3H]- spiperone from rat striatal membrane
In DepthDetails ArticlePubMed