BDBM50026572 3-Chloro-N-(1-ethyl-pyrrolidin-2-ylmethyl)-2,6-dimethoxy-benzamide::CHEMBL23932
SMILES CCN1CCC[C@H]1CNC(=O)c1c(OC)ccc(Cl)c1OC
InChI Key InChIKey=CQFIGXQADSIOPJ-NSHDSACASA-N
Data  1 IC50
  Tab Delimited (TSV)   2D SDfile   Computed 3D by Vconf -m prep SDfile
Find this compound or compounds like it in BindingDB:
Activity Spreadsheet -- Enzyme Inhibition Constant Data from BindingDB
Found 1 hit for monomerid = 50026572
TargetD(2) dopamine receptor(Rattus norvegicus (rat))
TBA
Curated by ChEMBL
LigandPNGBDBM50026572(3-Chloro-N-(1-ethyl-pyrrolidin-2-ylmethyl)-2,6-dim...)
Affinity DataIC50:  3.19E+3nM. Assay description: In vitro binding affinity at Dopamine receptor D2 in rat by displacing [3H]- spiperone from rat striatal membrane
In DepthDetails ArticlePubMed