BDBM50026779 7,10-Dimethoxy-1,2,3,4,4a,5,6,10b-octahydro-benzo[f]quinoline::CHEMBL33405
SMILES COc1ccc(OC)c2C3CCCN[C@H]3CCc12
InChI Key InChIKey=KZNMPLOCPFLSKP-KFJBMODSSA-N
Data  1 EC50
  Tab Delimited (TSV)   2D SDfile   Computed 3D by Vconf -m prep SDfile
Find this compound or compounds like it in BindingDB:
Activity Spreadsheet -- Enzyme Inhibition Constant Data from BindingDB
Found 1 hit for monomerid = 50026779
TargetAlpha-1A adrenergic receptor(Homo sapiens (Human))
TBA
Curated by ChEMBL
LigandPNGBDBM50026779(7,10-Dimethoxy-1,2,3,4,4a,5,6,10b-octahydro-benzo[...)
Affinity DataEC50:  200nM. Assay description: Alpha-1 adrenergic receptor agonist activity in rabbit ear artery
In DepthDetails ArticlePubMed