BDBM50026891 1-Pyridin-2-yl-ethanone::CHEMBL11945
SMILES CC(=O)c1ccccn1
InChI Key InChIKey=AJKVQEKCUACUMD-UHFFFAOYSA-N
Data  1 Kd
  Tab Delimited (TSV)   2D SDfile   Computed 3D by Vconf -m prep SDfile
Find this compound or compounds like it in BindingDB:
Activity Spreadsheet -- Enzyme Inhibition Constant Data from BindingDB
Found 1 hit for monomerid = 50026891
TargetStromelysin-1(Homo sapiens (Human))
Abbott Laboratories
Curated by ChEMBL
LigandPNGBDBM50026891(1-Pyridin-2-yl-ethanone | CHEMBL11945)
Affinity DataKd: >2.50E+7nM. Assay description: Binding to stromelysin (MMP-3) in place of acetohydroxamic acid.
In DepthDetails ArticlePubMed