BDBM50027089 methyl 3-(11-hydroxy-15-methoxy-3-methyl-13-oxa-3-azahexacyclo[13.2.2.12,8.01,6.06,14.07,12]icosa-7,9,11,18-tetraen-16-ylcarbamoyl)-(E)-2-propenoate
SMILES COC(=O)\C=C\C(=O)N[C@H]1C[C@]23C=C[C@]1(OC)[C@@H]1Oc4c5c(CC2N(C)CCC315)ccc4O
InChI Key InChIKey=WJWYCYGMXCHSSR-RMKUNRRTSA-N
Data  3 EC50
  Tab Delimited (TSV)   2D SDfile   Computed 3D by Vconf -m prep SDfile
Find this compound or compounds like it in BindingDB:
Activity Spreadsheet -- Enzyme Inhibition Constant Data from BindingDB
Found 3 hits for monomerid = 50027089
TargetDelta-type opioid receptor(Rattus norvegicus (rat))
TBA
Curated by ChEMBL
LigandPNGBDBM50027089(methyl 3-(11-hydroxy-15-methoxy-3-methyl-13-oxa-3-...)
Affinity DataEC50:  50nM. Assay description: The binding affinity was evaluated against [3H]dalamid binding to rat brain membranes (Opioid receptor delta 1)
In DepthDetails ArticlePubMed
TargetMu-type opioid receptor(Rattus norvegicus (rat))
TBA
Curated by ChEMBL
LigandPNGBDBM50027089(methyl 3-(11-hydroxy-15-methoxy-3-methyl-13-oxa-3-...)
Affinity DataEC50:  50nM. Assay description: The binding affinity was evaluated against [3H]dalamid binding to rat brain membranes (mu opiate receptors).
In DepthDetails ArticlePubMed
TargetDelta-type opioid receptor(Rattus norvegicus (rat))
TBA
Curated by ChEMBL
LigandPNGBDBM50027089(methyl 3-(11-hydroxy-15-methoxy-3-methyl-13-oxa-3-...)
Affinity DataEC50:  50nM. Assay description: The binding affinity was evaluated against [3H]dalamid binding to rat brain membranes (Opioid receptor delta 1)
In DepthDetails ArticlePubMed