BDBM50027140 1-[5-Benzoylamino-6-(4-benzyloxy-phenyl)-4-oxo-hexanoyl]-pyrrolidine-2-carboxylic acid benzyl ester::CHEMBL172356
SMILES O=C(CCC(=O)N1CCC[C@H]1C(=O)OCc1ccccc1)C(Cc1ccc(OCc2ccccc2)cc1)NC(=O)c1ccccc1
InChI Key InChIKey=LIJZWEBJPLIHNV-DNKZHYAASA-N
Data  1 IC50
  Tab Delimited (TSV)   2D SDfile   Computed 3D by Vconf -m prep SDfile
Find this compound or compounds like it in BindingDB:
Activity Spreadsheet -- Enzyme Inhibition Constant Data from BindingDB
Found 1 hit for monomerid = 50027140
TargetAngiotensin-converting enzyme 2(Homo sapiens (Human))
TBA
Curated by ChEMBL
LigandPNGBDBM50027140(1-[5-Benzoylamino-6-(4-benzyloxy-phenyl)-4-oxo-hex...)
Affinity DataIC50:  86nM. Assay description: Concentration required to inhibit the activity of Angiotensin I converting enzyme by 50%
In DepthDetails ArticlePubMed