BDBM50027147 1-[5-Benzoylamino-6-(4-hydroxy-phenyl)-4-oxo-hexanoyl]-pyrrolidine-2-carboxylic acid::CHEMBL173822
SMILES OC(=O)[C@@H]1CCCN1C(=O)CCC(=O)C(Cc1ccc(O)cc1)NC(=O)c1ccccc1
InChI Key InChIKey=NDMBLCSBXANGDL-ANYOKISRSA-N
Data  1 IC50
  Tab Delimited (TSV)   2D SDfile   Computed 3D by Vconf -m prep SDfile
Find this compound or compounds like it in BindingDB:
Activity Spreadsheet -- Enzyme Inhibition Constant Data from BindingDB
Found 1 hit for monomerid = 50027147
TargetAngiotensin-converting enzyme 2(Homo sapiens (Human))
TBA
Curated by ChEMBL
LigandPNGBDBM50027147(1-[5-Benzoylamino-6-(4-hydroxy-phenyl)-4-oxo-hexan...)
Affinity DataIC50:  4.70nM. Assay description: Concentration required to inhibit the activity of Angiotensin I converting enzyme by 50%
In DepthDetails ArticlePubMed