BDBM50027353 CHEMBL216386::Glu-Trp-Pro-Arg-Pro-Gln-Ile-Pro-Pro
SMILES CC[C@H](C)[C@H](NC(=O)[C@H](CCC(N)=O)NC(=O)[C@@H]1CCCN1C(=O)[C@H](CCCNC(N)=N)NC(=O)[C@@H]1CCCN1C(=O)[C@H](Cc1c[nH]c2ccccc12)NC(=O)[C@@H](N)CCC(O)=O)C(=O)N1CCC[C@H]1C(=O)N1CCC[C@H]1C(O)=O
InChI Key InChIKey=RDZJYRCUGADIDN-AXPLDACSSA-N
Data  2 KI
  Tab Delimited (TSV)   2D SDfile   Computed 3D by Vconf -m prep SDfile
Find this compound or compounds like it in BindingDB:
Activity Spreadsheet -- Enzyme Inhibition Constant Data from BindingDB
Found 2 hits for monomerid = 50027353
TargetAngiotensin-converting enzyme(Homo sapiens (Human))
TBA
Curated by ChEMBL
LigandPNGBDBM50027353(CHEMBL216386 | Glu-Trp-Pro-Arg-Pro-Gln-Ile-Pro-Pro)
Affinity DataKi:  100nM. Assay description: Inhibitory activity of the compound against Angiotensin I converting enzyme
In DepthDetails Article
TargetRenin(Homo sapiens (Human))
TBA
Curated by ChEMBL
LigandPNGBDBM50027353(CHEMBL216386 | Glu-Trp-Pro-Arg-Pro-Gln-Ile-Pro-Pro)
Affinity DataKi:  800nM. Assay description: Antihypertensive activity against human renin
In DepthDetails ArticlePubMed