BDBM50027396 CHEMBL603243
SMILES CCCNC(=O)Nc1n[nH]c2c1CN(C(=O)C1CCN(C)CC1)C2(C)C
InChI Key InChIKey=SMHOLGURUXBSTC-UHFFFAOYSA-N
Data  1 IC50
  Tab Delimited (TSV)   2D SDfile   Computed 3D by Vconf -m prep SDfile
Find this compound or compounds like it in BindingDB:
Activity Spreadsheet -- Enzyme Inhibition Constant Data from BindingDB
Found 1 hit for monomerid = 50027396
TargetCyclin-A1/Cyclin-A2/Cyclin-dependent kinase 2(Homo sapiens (Human))
Nerviano Medical Sciences
Curated by ChEMBL
LigandPNGBDBM50027396(CHEMBL603243)
Affinity DataIC50:  11nM. Assay description: Inhibition of human CDK2/cyclin A expressed in Escherichia coli BL21 by scintillation proximity assay
In DepthDetails ArticlePubMed