BDBM50027478 1-[2-(3-Benzoylamino-2-oxo-4-phenyl-butylsulfanyl)-acetyl]-pyrrolidine-2-carboxylic acid::CHEMBL177842
SMILES OC(=O)[C@H]1CCCN1C(=O)CSCC(=O)C(Cc1ccccc1)NC(=O)c1ccccc1
InChI Key InChIKey=STQFKBJPBVBXSG-GFOWMXPYSA-N
Data  1 IC50
  Tab Delimited (TSV)   2D SDfile   Computed 3D by Vconf -m prep SDfile
Find this compound or compounds like it in BindingDB:
Activity Spreadsheet -- Enzyme Inhibition Constant Data from BindingDB
Found 1 hit for monomerid = 50027478
TargetAngiotensin-converting enzyme 2(Homo sapiens (Human))
TBA
Curated by ChEMBL
LigandPNGBDBM50027478(1-[2-(3-Benzoylamino-2-oxo-4-phenyl-butylsulfanyl)...)
Affinity DataIC50:  12nM. Assay description: Concentration required for 50% inhibition of Angiotensin I converting enzyme
In DepthDetails ArticlePubMed