BDBM50027570 CHEMBL90534::sodium ethyl ethoxycarbonylphosphonate
SMILES CCOC(=O)P([O-])(=O)OCC
InChI Key InChIKey=GBHHYGCUMKFRMT-UHFFFAOYSA-M
Data  1 IC50
  Tab Delimited (TSV)   2D SDfile   Computed 3D by Vconf -m prep SDfile
Find this compound or compounds like it in BindingDB:
Activity Spreadsheet -- Enzyme Inhibition Constant Data from BindingDB
Found 1 hit for monomerid = 50027570
TargetDNA polymerase catalytic subunit(Human herpesvirus 1 (strain 17) (HHV-1) (Human her...)
TBA
Curated by ChEMBL
LigandPNGBDBM50027570(CHEMBL90534 | sodium ethyl ethoxycarbonylphosphona...)
Affinity DataIC50: >5.00E+5nM. Assay description: Inhibition of HSV-1 DNA polymerase in HSV-1 C42 plaque reduction assay
In DepthDetails ArticlePubMed