BDBM50027870 CHEMBL2348196
SMILES COc1ccc(NC(=O)NCCNCC(O)COc2ccc(OCCOC3CCCC3)cc2)cc1
InChI Key InChIKey=LXJWOHAAEMZVAW-UHFFFAOYSA-N
Data  2 Kd
  Tab Delimited (TSV)   2D SDfile   Computed 3D by Vconf -m prep SDfile
Find this compound or compounds like it in BindingDB:
Activity Spreadsheet -- Enzyme Inhibition Constant Data from BindingDB
Found 2 hits for monomerid = 50027870
TargetBeta-2 adrenergic receptor(Homo sapiens (Human))
University Of Nottingham
Curated by ChEMBL
LigandPNGBDBM50027870(CHEMBL2348196)
Affinity DataKd:  1.38E+3nM. Assay description: Displacement of [3H]-CGP12177 from human beta2 adrenoceptor expressed in CHOK1 cells after 2 hrs by scintillation counting analysis
In DepthDetails ArticlePubMed
TargetBeta-1 adrenergic receptor(Homo sapiens (Human))
University Of Nottingham
Curated by ChEMBL
LigandPNGBDBM50027870(CHEMBL2348196)
Affinity DataKd:  16nM. Assay description: Displacement of [3H]-CGP12177 from human beta1 adrenoceptor expressed in CHOK1 cells after 2 hrs by scintillation counting analysis
In DepthDetails ArticlePubMed