BDBM50028540 2-{4-[(2,4-Diamino-pteridin-6-ylmethyl)-methyl-amino]-benzoylamino}-4-dimethylcarbamoyl-butyric acid::CHEMBL55590
SMILES CN(C)C(=O)CCC(NC(=O)c1ccc(cc1)N(C)Cc1cnc2nc(N)nc(N)c2n1)C(O)=O
InChI Key InChIKey=BHFZGVOUGIGQGR-UHFFFAOYSA-N
Data  1 KI
  Tab Delimited (TSV)   2D SDfile   Computed 3D by Vconf -m prep SDfile
Find this compound or compounds like it in BindingDB:
Activity Spreadsheet -- Enzyme Inhibition Constant Data from BindingDB
Found 1 hit for monomerid = 50028540
TargetDihydrofolate reductase(Mus musculus (Mouse))
TBA
Curated by ChEMBL
LigandPNGBDBM50028540(2-{4-[(2,4-Diamino-pteridin-6-ylmethyl)-methyl-ami...)
Affinity DataKi:  0.00390nM. Assay description: Inhibition of Dihydrofolate reductase in mouse L1210 cells
In DepthDetails ArticlePubMed