BDBM50028592 4-Amino-1-(4-hydroxy-5-hydroxymethyl-tetrahydro-furan-2-yl)-5-methyl-1H-pyrimidin-2-one::CHEMBL1234242
SMILES Cc1cn([C@H]2C[C@H](O)[C@@H](CO)O2)c(=O)nc1N
InChI Key InChIKey=LUCHPKXVUGJYGU-UHFFFAOYSA-N
Data  2 KI
PDB links: 11 PDB IDs match this monomer.
  Tab Delimited (TSV)   2D SDfile   Computed 3D by Vconf -m prep SDfile
Find this compound or compounds like it in BindingDB:
Activity Spreadsheet -- Enzyme Inhibition Constant Data from BindingDB
Found 2 hits for monomerid = 50028592
TargetThymidine kinase, cytosolic(Rattus norvegicus)
TBA
Curated by ChEMBL
LigandPNGBDBM50028592(4-Amino-1-(4-hydroxy-5-hydroxymethyl-tetrahydro-fu...)
Affinity DataKi:  1.30E+6nM. Assay description: Competitive inhibition against rat cytoplasmic Thymidine kinase
In DepthDetails ArticlePubMed
TargetThymidine kinase, cytosolic(Rattus norvegicus)
TBA
Curated by ChEMBL
LigandPNGBDBM50028592(4-Amino-1-(4-hydroxy-5-hydroxymethyl-tetrahydro-fu...)
Affinity DataKi:  2.10E+6nM. Assay description: Competitive inhibition against rat cytoplasmic Thymidine kinase
In DepthDetails ArticlePubMed