BDBM50028944 CHEMBL1738910
SMILES OC(=O)[C@H](Cc1c[nH]c2ccccc12)NS(=O)(=O)c1ccc(Cl)c(c1)C(F)(F)F
InChI Key
Data  1 KI
PDB links: 1 PDB ID matches this monomer.
  Tab Delimited (TSV)   2D SDfile   Computed 3D by Vconf -m prep SDfile
Find this compound or compounds like it in BindingDB:
Activity Spreadsheet -- Enzyme Inhibition Constant Data from BindingDB
Found 1 hit for monomerid = 50028944
TargetMatrilysin(Homo sapiens (Human))
Universidad Ceu San Pablo
Curated by ChEMBL
LigandPNGBDBM50028944(CHEMBL1738910)
Affinity DataKi:  1.00E+4nM. Assay description: Inhibition of MMP7 (unknown origin)