BDBM50028976 4-(2-Chloro-5H-dibenzo[a,d]cyclohepten-10-yl)-1-methyl-piperidine::CHEMBL7430
SMILES CN1CCC(CC1)C1=Cc2cc(Cl)ccc2Cc2ccccc12
InChI Key InChIKey=ZABVPBHKTKEJLW-UHFFFAOYSA-N
Data  5 KI  2 IC50
  Tab Delimited (TSV)   2D SDfile   Computed 3D by Vconf -m prep SDfile
Find this compound or compounds like it in BindingDB:
Activity Spreadsheet -- Enzyme Inhibition Constant Data from BindingDB
Found 7 hits for monomerid = 50028976
Target5-hydroxytryptamine receptor 2C(Rattus norvegicus (Rat))
Vanderbilt University
Curated by ChEMBL
LigandPNGBDBM50028976(4-(2-Chloro-5H-dibenzo[a,d]cyclohepten-10-yl)-1-me...)
Affinity DataKi:  3nM. Assay description: Affinity was evaluated as inhibition constant for serotonin 5-hydroxytryptamine 2C receptor
In DepthDetails ArticlePubMed
Target5-hydroxytryptamine receptor 2A(Rattus norvegicus (rat))
Vanderbilt University
Curated by ChEMBL
LigandPNGBDBM50028976(4-(2-Chloro-5H-dibenzo[a,d]cyclohepten-10-yl)-1-me...)
Affinity DataKi:  3nM. Assay description: Affinity was evaluated as inhibition constant for serotonin 5-hydroxytryptamine 2A receptor
In DepthDetails ArticlePubMed
Target5-hydroxytryptamine receptor 3A/3B(Rattus norvegicus)
Vanderbilt University
Curated by ChEMBL
LigandPNGBDBM50028976(4-(2-Chloro-5H-dibenzo[a,d]cyclohepten-10-yl)-1-me...)
Affinity DataKi:  41nM. Assay description: Affinity of the compound was evaluated as inhibition constant for serotonin 5-hydroxytryptamine 3 receptor
In DepthDetails ArticlePubMed
TargetD(2) dopamine receptor(Homo sapiens (Human))
Vanderbilt University
Curated by ChEMBL
LigandPNGBDBM50028976(4-(2-Chloro-5H-dibenzo[a,d]cyclohepten-10-yl)-1-me...)
Affinity DataKi:  560nM. Assay description: Affinity was evaluated as inhibition constant for dopamine D-2 receptor
In DepthDetails ArticlePubMed
TargetD(4) dopamine receptor(Homo sapiens (Human))
Vanderbilt University
Curated by ChEMBL
LigandPNGBDBM50028976(4-(2-Chloro-5H-dibenzo[a,d]cyclohepten-10-yl)-1-me...)
Affinity DataKi:  2.70E+3nM. Assay description: Affinity was evaluated as inhibition constant for dopamine D-4 receptor
In DepthDetails ArticlePubMed
TargetD(1A)/D(1B)/D(2)/D(3)/D(4) dopamine receptor(Rattus norvegicus (rat))
TBA
Curated by ChEMBL
LigandPNGBDBM50028976(4-(2-Chloro-5H-dibenzo[a,d]cyclohepten-10-yl)-1-me...)
Affinity DataIC50:  678nM. Assay description: Relative affinity for dopamine receptor by displacement of [3H]spiroperidol (2.2 nM) from (in vitro) dopamine binding sites in rat caudate nuclei
In DepthDetails ArticlePubMed
LigandPNGBDBM50028976(4-(2-Chloro-5H-dibenzo[a,d]cyclohepten-10-yl)-1-me...)
Affinity DataIC50:  622nM. Assay description: Concentration required (in vitro) to displace 50% specific binding of [3H]clozapine to Muscarinic acetylcholine receptor in rat brain
In DepthDetails ArticlePubMed