BDBM50029111 CHEMBL3360829
SMILES CC(=N)NCCC[C@H](NC(=O)C12CC3CC(CC(C3)C1)C2)C(=O)N[C@@H](Cc1ccccc1)C(N)=O
InChI Key InChIKey=ZSNBKIJZDPKMTI-VTZSGNMKSA-N
Data  5 KI  1 EC50
  Tab Delimited (TSV)   2D SDfile   Computed 3D by Vconf -m prep SDfile
Find this compound or compounds like it in BindingDB:
Activity Spreadsheet -- Enzyme Inhibition Constant Data from BindingDB
Found 6 hits for monomerid = 50029111
TargetNeuropeptide FF receptor 1(Homo sapiens (Human))
The University Of Mississippi
Curated by ChEMBL
LigandPNGBDBM50029111(CHEMBL3360829)
Affinity DataKi:  58nM. Assay description: Antagonist activity at human NPFF1 receptor expressed in CHO cells
In DepthDetails ArticlePubMed
TargetNeuropeptide FF receptor 2(Homo sapiens (Human))
The University Of Mississippi
Curated by ChEMBL
LigandPNGBDBM50029111(CHEMBL3360829)
Affinity DataKi:  75nM. Assay description: Antagonist activity at human NPFF2 receptor expressed in African green monkey COS-1 cells
In DepthDetails ArticlePubMed
TargetKappa-type opioid receptor(Homo sapiens (Human))
The University Of Mississippi
Curated by ChEMBL
LigandPNGBDBM50029111(CHEMBL3360829)
Affinity DataKi: >5.00E+3nM. Assay description: Displacement of [3H]diprenorphine from human KOR expressed in CHO cells after 1 hr
In DepthDetails ArticlePubMed
TargetMu-type opioid receptor(Homo sapiens (Human))
The University Of Mississippi
Curated by ChEMBL
LigandPNGBDBM50029111(CHEMBL3360829)
Affinity DataKi: >5.00E+3nM. Assay description: Displacement of [3H]diprenorphine from human MOR expressed in African green monkey COS-1 cells after 1 hr
In DepthDetails ArticlePubMed
TargetDelta-type opioid receptor(Homo sapiens (Human))
The University Of Mississippi
Curated by ChEMBL
LigandPNGBDBM50029111(CHEMBL3360829)
Affinity DataKi: >5.00E+3nM. Assay description: Displacement of [3H]diprenorphine from human DOR expressed in African green monkey COS-1 cells after 1 hr
In DepthDetails ArticlePubMed
TargetNeuropeptide FF receptor 1(Homo sapiens (Human))
The University Of Mississippi
Curated by ChEMBL
LigandPNGBDBM50029111(CHEMBL3360829)
Affinity DataEC50:  4.70E+3nM. Assay description: Antagonist activity at human NPFF1 receptor expressed in CHO cells assessed as inhibition of forskolin-induced intracellular cAMP accumulation relati...
In DepthDetails ArticlePubMed