BDBM50029235 CHEMBL3084924::Pyridin-3-yl-acetic acid 2-methyl-adamantan-2-yl ester
SMILES CC1(OC(=O)Cc2cccnc2)C2CC3CC(C2)CC1C3
InChI Key InChIKey=DBGZAEICQRQMAF-UHFFFAOYSA-N
Data  3 IC50
  Tab Delimited (TSV)   2D SDfile   Computed 3D by Vconf -m prep SDfile
Find this compound or compounds like it in BindingDB:
Activity Spreadsheet -- Enzyme Inhibition Constant Data from BindingDB
Found 3 hits for monomerid = 50029235
TargetAromatase(Homo sapiens (Human))
Crc Laboratory
Curated by ChEMBL
LigandPNGBDBM50029235(CHEMBL3084924 | Pyridin-3-yl-acetic acid 2-methyl-...)
Affinity DataIC50:  1.90E+3nM. Assay description: Tested for inhibition of human placental Cytochrome P450 19A1
In DepthDetails ArticlePubMed
TargetSteroid 17-alpha-hydroxylase/17,20 lyase(Homo sapiens (Human))
Crc Laboratory
Curated by ChEMBL
LigandPNGBDBM50029235(CHEMBL3084924 | Pyridin-3-yl-acetic acid 2-methyl-...)
Affinity DataIC50:  320nM. Assay description: Tested for inhibition of human testicular C17,20-Lyase.
In DepthDetails ArticlePubMed
TargetSteroid 17-alpha-hydroxylase/17,20 lyase(Homo sapiens (Human))
Crc Laboratory
Curated by ChEMBL
LigandPNGBDBM50029235(CHEMBL3084924 | Pyridin-3-yl-acetic acid 2-methyl-...)
Affinity DataIC50:  1.90E+3nM. Assay description: Tested for inhibition of human testicular Steroid 17-alpha-hydroxylase/17,20 lyase
In DepthDetails ArticlePubMed