BDBM50029263 N-Isopropyl-N-{5-[4-(2-methoxy-phenyl)-piperazin-1-ylmethyl]-1-methyl-1H-pyrrol-2-ylmethyl}-acetamide;succinate
SMILES COc1ccccc1N1CCN(Cc2ccc(CN(C(C)C)C(C)=O)n2C)CC1
InChI Key InChIKey=LKZRCPKUNMYEDG-UHFFFAOYSA-N
Data  2 KI
  Tab Delimited (TSV)   2D SDfile   Computed 3D by Vconf -m prep SDfile
Find this compound or compounds like it in BindingDB:
Activity Spreadsheet -- Enzyme Inhibition Constant Data from BindingDB
Found 2 hits for monomerid = 50029263
Target5-hydroxytryptamine receptor 1A(Rattus norvegicus (rat))
R. W. Johnson Pharmaceutical Research Institute
Curated by ChEMBL
LigandPNGBDBM50029263(N-Isopropyl-N-{5-[4-(2-methoxy-phenyl)-piperazin-1...)
Affinity DataKi:  16nM. Assay description: Binding affinity was determined against 5-hydroxytryptamine 1A receptor using [3H]WB-4101
In DepthDetails ArticlePubMed
TargetD(2) dopamine receptor(Rattus norvegicus (rat))
R. W. Johnson Pharmaceutical Research Institute
Curated by ChEMBL
LigandPNGBDBM50029263(N-Isopropyl-N-{5-[4-(2-methoxy-phenyl)-piperazin-1...)
Affinity DataKi:  30nM. Assay description: Binding affinity was determined against Dopamine receptor D2 using [3H]spiperone
In DepthDetails ArticlePubMed