BDBM50029278 1-(5-{2-[4-(2-Isopropoxy-phenyl)-piperazin-1-yl]-ethyl}-1-methyl-1H-pyrrol-2-ylmethyl)-piperidin-2-one;succinate
SMILES CC(C)Oc1ccccc1N1CCN(CCc2ccc(CN3CCCCC3=O)n2C)CC1
InChI Key InChIKey=GGAUGSHUWKTQAH-UHFFFAOYSA-N
Data  2 KI
  Tab Delimited (TSV)   2D SDfile   Computed 3D by Vconf -m prep SDfile
Find this compound or compounds like it in BindingDB:
Activity Spreadsheet -- Enzyme Inhibition Constant Data from BindingDB
Found 2 hits for monomerid = 50029278
Target5-hydroxytryptamine receptor 1A(Rattus norvegicus (rat))
R. W. Johnson Pharmaceutical Research Institute
Curated by ChEMBL
LigandPNGBDBM50029278(1-(5-{2-[4-(2-Isopropoxy-phenyl)-piperazin-1-yl]-e...)
Affinity DataKi:  1.5nM. Assay description: Binding affinity was determined against 5-hydroxytryptamine 1A receptor using [3H]WB-4101
In DepthDetails ArticlePubMed
TargetD(2) dopamine receptor(Rattus norvegicus (rat))
R. W. Johnson Pharmaceutical Research Institute
Curated by ChEMBL
LigandPNGBDBM50029278(1-(5-{2-[4-(2-Isopropoxy-phenyl)-piperazin-1-yl]-e...)
Affinity DataKi:  26nM. Assay description: Binding affinity was determined against Dopamine receptor D2 using [3H]spiperone
In DepthDetails ArticlePubMed