BDBM50029709 2-(4-Benzyl-2-methyl-5-oxo-2,5-dihydro-furan-3-yloxymethyl)-4-isopropyl-6-methoxy-1,1-dioxo-1,2-dihydro-1lambda*6*-benzo[d]isothiazol-3-one::CHEMBL140865
SMILES COc1cc2c(C(=O)N(COC3=C(Cc4ccccc4)C(=O)OC3C)S2(=O)=O)c(c1)C(C)C
InChI Key InChIKey=OMWAQNFPRMCHIQ-UHFFFAOYSA-N
Data  1 KI
  Tab Delimited (TSV)   2D SDfile   Computed 3D by Vconf -m prep SDfile
Find this compound or compounds like it in BindingDB:
Activity Spreadsheet -- Enzyme Inhibition Constant Data from BindingDB
Found 1 hit for monomerid = 50029709
TargetNeutrophil elastase(Homo sapiens (Human))
Sterling Winthrop Pharmaceuticals Research Division
Curated by ChEMBL
LigandPNGBDBM50029709(2-(4-Benzyl-2-methyl-5-oxo-2,5-dihydro-furan-3-ylo...)
Affinity DataKi:  0.0160nM. Assay description: Potency of inhibition of human leukocyte elastase is expressed as apparent binding constant
In DepthDetails ArticlePubMed