BDBM50030154 Arg-Pro-Lys-Pro-Gln-Gln-(2S,3S)Bfi-Phe-Gly-Leu-Met::CHEMBL2372519
SMILES [#6]-[#16]-[#6]-[#6]-[#6@@H](-[#7]-[#6](=O)-[#6@H](-[#6]-[#6](-[#6])-[#6])-[#7]-[#6](=O)-[#6]-[#7]-[#6](=O)-[#6@H](-[#6]-c1ccccc1)-[#7]-[#6](=O)-[#6@@H](-[#7]-[#6](=O)-[#6@H](-[#6]-[#6]-[#6](-[#7])=O)-[#7]-[#6](=O)-[#6@H](-[#6]-[#6]-[#6](-[#7])=O)-[#7]-[#6](=O)-[#6@@H]-1-[#6]-[#6]-[#6]-[#7]-1-[#6](=O)-[#6@H](-[#6]-[#6]-[#6]-[#6]-[#7])-[#7]-[#6](=O)-[#6@@H]-1-[#6]-[#6]-[#6]-[#7]-1-[#6](=O)-[#6@@H](-[#7])-[#6]-[#6]-[#6]\[#7]=[#6](\[#7])-[#7])-[#6]-1-[#6]-[#6]-c2cc3ccccc3cc-12)-[#6](-[#7])=O
InChI Key InChIKey=WQSGBFGBMHNIPB-OBQPEBBISA-N
Data  3 IC50
  Tab Delimited (TSV)   2D SDfile   Computed 3D by Vconf -m prep SDfile
Find this compound or compounds like it in BindingDB:
Activity Spreadsheet -- Enzyme Inhibition Constant Data from BindingDB
Found 3 hits for monomerid = 50030154
TargetNeuromedin-K receptor(Rattus norvegicus)
Universit£
Curated by ChEMBL
LigandPNGBDBM50030154(Arg-Pro-Lys-Pro-Gln-Gln-(2S,3S)Bfi-Phe-Gly-Leu-Met...)
Affinity DataIC50:  120nM. Assay description: Concentration required to inhibit the specific binding of [125I]BH-ELE to Neurokinin-3 (NK-3) receptor in rat brain synaptosomes
In DepthDetails ArticlePubMed
TargetSubstance-K receptor(Rattus norvegicus (Rat))
Universit£
Curated by ChEMBL
LigandPNGBDBM50030154(Arg-Pro-Lys-Pro-Gln-Gln-(2S,3S)Bfi-Phe-Gly-Leu-Met...)
Affinity DataIC50:  120nM. Assay description: Concentration required to inhibit the specific binding of [125I]NKA to Neurokinin-2 (NK-2) receptor in rat duodenum membranes
In DepthDetails ArticlePubMed
TargetSubstance-P receptor(Rattus norvegicus (rat))
Universit£
Curated by ChEMBL
LigandPNGBDBM50030154(Arg-Pro-Lys-Pro-Gln-Gln-(2S,3S)Bfi-Phe-Gly-Leu-Met...)
Affinity DataIC50:  120nM. Assay description: Concentration required to inhibit the specific binding of [125I]BH-SP to Neurokinin-1 (NK-1) receptor in rat brain synaptosomes
In DepthDetails ArticlePubMed