BDBM50030156 Arg-Pro-Lys-Pro-Gln-Gln-Dip-Phe-Gly-Leu-Met::CHEMBL406442
SMILES CSCC[C@H](NC(=O)[C@H](CC(C)C)NC(=O)CNC(=O)[C@H](Cc1ccccc1)NC(=O)[C@@H](NC(=O)[C@H](CCC(N)=O)NC(=O)[C@H](CCC(N)=O)NC(=O)[C@H]1CCCN1C(=O)[C@H](CCCCN)NC(=O)[C@@H]1CCCN1C(=O)[C@@H](N)CCCNC(N)=N)C(c1ccccc1)c1ccccc1)C(N)=O
InChI Key InChIKey=MMLQIMNWUNFRQK-QUFQHBKWSA-N
Data  3 IC50
  Tab Delimited (TSV)   2D SDfile   Computed 3D by Vconf -m prep SDfile
Find this compound or compounds like it in BindingDB:
Activity Spreadsheet -- Enzyme Inhibition Constant Data from BindingDB
Found 3 hits for monomerid = 50030156
TargetNeuromedin-K receptor(Rattus norvegicus)
Universit£
Curated by ChEMBL
LigandPNGBDBM50030156(Arg-Pro-Lys-Pro-Gln-Gln-Dip-Phe-Gly-Leu-Met | CHEM...)
Affinity DataIC50:  1.70E+4nM. Assay description: Concentration required to inhibit the specific binding of [125I]BH-ELE to Neurokinin-3 (NK-3) receptor in rat brain synaptosomes
In DepthDetails ArticlePubMed
TargetSubstance-P receptor(Rattus norvegicus (rat))
Universit£
Curated by ChEMBL
LigandPNGBDBM50030156(Arg-Pro-Lys-Pro-Gln-Gln-Dip-Phe-Gly-Leu-Met | CHEM...)
Affinity DataIC50:  1.30E+3nM. Assay description: Concentration required to inhibit the specific binding of [125I]BH-SP to Neurokinin-1 (NK-1) receptor in rat brain synaptosomes
In DepthDetails ArticlePubMed
TargetSubstance-K receptor(Rattus norvegicus (Rat))
Universit£
Curated by ChEMBL
LigandPNGBDBM50030156(Arg-Pro-Lys-Pro-Gln-Gln-Dip-Phe-Gly-Leu-Met | CHEM...)
Affinity DataIC50:  3.60E+3nM. Assay description: Concentration required to inhibit the specific binding of [125I]NKA to Neurokinin-2 (NK-2) receptor in rat duodenum membranes
In DepthDetails ArticlePubMed