BDBM50030244 (3-Hydroxy-5-methyl-isoxazol-4-yl)-methylamino-acetic acid::CHEMBL112755::N-methyl-AMAA
SMILES CNC(C(O)=O)c1c(C)o[nH]c1=O
InChI Key InChIKey=LWRZENUXXSTRBD-UHFFFAOYSA-N
Data  5 KI
  Tab Delimited (TSV)   2D SDfile   Computed 3D by Vconf -m prep SDfile
Find this compound or compounds like it in BindingDB:
Activity Spreadsheet -- Enzyme Inhibition Constant Data from BindingDB
Found 5 hits for monomerid = 50030244
TargetGlutamate receptor ionotropic, NMDA 1(RAT)
Royal Danish School Of Pharmacy
Curated by PDSP Ki Database
LigandPNGBDBM50030244((3-Hydroxy-5-methyl-isoxazol-4-yl)-methylamino-ace...)
Affinity DataKi: >1.00E+4nM
In DepthDetails ArticlePubMed
TargetGlutamate receptor ionotropic, NMDA 1(RAT)
Royal Danish School Of Pharmacy
Curated by PDSP Ki Database
LigandPNGBDBM50030244((3-Hydroxy-5-methyl-isoxazol-4-yl)-methylamino-ace...)
Affinity DataKi: >1.00E+4nM
In DepthDetails ArticlePubMed
TargetGlutamate receptor ionotropic, NMDA 1(RAT)
Royal Danish School Of Pharmacy
Curated by PDSP Ki Database
LigandPNGBDBM50030244((3-Hydroxy-5-methyl-isoxazol-4-yl)-methylamino-ace...)
Affinity DataKi: >1.00E+4nM
In DepthDetails ArticlePubMed
TargetGlutamate receptor ionotropic, NMDA 1(RAT)
Royal Danish School Of Pharmacy
Curated by PDSP Ki Database
LigandPNGBDBM50030244((3-Hydroxy-5-methyl-isoxazol-4-yl)-methylamino-ace...)
Affinity DataKi: >1.00E+4nM
In DepthDetails ArticlePubMed
TargetGlutamate receptor ionotropic, NMDA 1(RAT)
Royal Danish School Of Pharmacy
Curated by PDSP Ki Database
LigandPNGBDBM50030244((3-Hydroxy-5-methyl-isoxazol-4-yl)-methylamino-ace...)
Affinity DataKi: >1.00E+4nM
In DepthDetails ArticlePubMed