BDBM50030386 (1S)-1-methyl-16-azatetracyclo[7.6.1.0^{2,7}.0^{10,15}]hexadeca-2(7),3,5,10,12,14-hexaene; (2Z)-but-2-enedioate::1-methyl-16-azatetracyclo[7.6.1.02,7.010,15]hexadeca-2(7),3,5,10(15),11,13-hexaene maleate((+)-MK801)
SMILES C[C@]12N[C@H](Cc3ccccc13)c1ccccc21
InChI Key InChIKey=LBOJYSIDWZQNJS-CVEARBPZSA-N
Data  1 KI
PDB links: 2 PDB IDs match this monomer.
  Tab Delimited (TSV)   2D SDfile   Computed 3D by Vconf -m prep SDfile
Find this compound or compounds like it in BindingDB:
Activity Spreadsheet -- Enzyme Inhibition Constant Data from BindingDB
Found 1 hit for monomerid = 50030386
TargetGlutamate receptor ionotropic, NMDA 2B(Rattus norvegicus (Rat))
Istituto Italiano Di Tecnologia
Curated by ChEMBL
LigandPNGBDBM50030386((1S)-1-methyl-16-azatetracyclo[7.6.1.0^{2,7}.0^{10...)
Affinity DataKi: >1.00E+5nM. Assay description: Displacement of [3H]Ifenprodil from NMDAR-2B in Sprague-Dawley rat frontal cortex homogenates after 2 hrs by liquid scintillation counting