BDBM50030677 CHEMBL3344541
SMILES COc1ccc(cc1)C(=O)c1sc2nc(C)c(C(C)=O)c(-c3cc(OC)c(OC)c(OC)c3)c2c1N
InChI Key InChIKey=ILTHGBCIUFBFBA-UHFFFAOYSA-N
Data  2 EC50
  Tab Delimited (TSV)   2D SDfile   Computed 3D by Vconf -m prep SDfile
Find this compound or compounds like it in BindingDB:
Activity Spreadsheet -- Enzyme Inhibition Constant Data from BindingDB
Found 2 hits for monomerid = 50030677
TargetMultidrug resistance-associated protein 1(Homo sapiens (Human))
Institute Of Organic Synthesis
Curated by ChEMBL
LigandPNGBDBM50030677(CHEMBL3344541)
Affinity DataEC50:  6.60E+3nM. Assay description: Modulation of MRP1 mediated drug efflux in doxorubicin-resistant human H69 cells assessed as accumulation of calcein AM incubated for 15 mins prior t...
In DepthDetails ArticlePubMed
TargetBroad substrate specificity ATP-binding cassette transporter ABCG2(Homo sapiens (Human))
Institute Of Organic Synthesis
Curated by ChEMBL
LigandPNGBDBM50030677(CHEMBL3344541)
Affinity DataEC50:  2.60E+3nM. Assay description: Modulation of BCRP1 mediated drug efflux in mitoxantrone-resistant human MES-SA cells assessed as accumulation of hoechst 33342 incubated for 15 mins...
In DepthDetails ArticlePubMed