BDBM50030741 CHEMBL3342134
SMILES CCOC(=O)c1c(C)nc2oc(C(=O)c3ccc(OC)cc3)c(N)c2c1-c1cc(OC)c(OC)c(OC)c1
InChI Key InChIKey=HEIFSVSFDAUGGV-UHFFFAOYSA-N
Data  1 EC50
  Tab Delimited (TSV)   2D SDfile   Computed 3D by Vconf -m prep SDfile
Find this compound or compounds like it in BindingDB:
Activity Spreadsheet -- Enzyme Inhibition Constant Data from BindingDB
Found 1 hit for monomerid = 50030741
TargetBroad substrate specificity ATP-binding cassette transporter ABCG2(Homo sapiens (Human))
Institute Of Organic Synthesis
Curated by ChEMBL
LigandPNGBDBM50030741(CHEMBL3342134)
Affinity DataEC50:  3.40E+3nM. Assay description: Modulation of BCRP1 mediated drug efflux in mitoxantrone-resistant human MES-SA cells assessed as accumulation of hoechst 33342 incubated for 15 mins...
In DepthDetails ArticlePubMed