BDBM50030850 CHEMBL3342720
SMILES CC(C)c1cc(-c2noc(NC(=O)C3CC3)c2-c2ccc(CN3CCOCC3)cc2)c(O)cc1O
InChI Key InChIKey=HCEPAGMKRSAQJJ-UHFFFAOYSA-N
Data  1 IC50
PDB links: 1 PDB ID matches this monomer.
  Tab Delimited (TSV)   2D SDfile   Computed 3D by Vconf -m prep SDfile
Find this compound or compounds like it in BindingDB:
Activity Spreadsheet -- Enzyme Inhibition Constant Data from BindingDB
Found 1 hit for monomerid = 50030850
TargetHeat shock protein HSP 90-alpha(Homo sapiens (Human))
Chinese Academy Of Sciences
Curated by ChEMBL
LigandPNGBDBM50030850(CHEMBL3342720)
Affinity DataIC50:  27nM. Assay description: Inhibition of HSP90alpha (unknown origin) after 16 hrs by FP enzymatic assay